{"text_format":"1","workbook":"xlsx","n_sheets":8,"sheets":["Seuil de sig. du groupe","Sheet1","Données sur les composantes","Analyse des composantes","Seuil de sig. des composantes","SecurityLabel","Round","Comp_Mult_Calc"],"not_rendered":{"charts":0,"images":31,"macros":1,"external_links":1,"defined_names":66,"comments":1,"pivot_tables":0},"unopened":[],"bounds":{"document_bytes":16777216,"sheet_cells":100000,"rows_first":2000,"rows_last":500,"rows_between":2000,"halvings":0,"cell_chars":16384,"cell_head_chars":4096},"cells_cut":0,"cells_raw":0,"read":"whole","date_system":"1900"}

{"sheet":"Seuil de sig. du groupe","index":0,"n_rows":111,"n_cols":21,"rows_kept":111,"cut":false,"hidden":false,"merged":[[12,15,12,20],[12,4,12,6],[2,19,2,21],[27,16,28,20],[27,12,28,15],[14,15,18,20],[20,4,20,20],[25,12,25,20],[23,12,23,20],[10,12,10,20],[8,4,8,20],[4,4,6,7],[6,11,6,12],[4,11,4,19],[27,4,27,6],[25,4,25,6],[52,15,56,20],[30,4,30,20],[33,12,33,20],[48,8,48,20],[50,4,50,20],[49,8,49,12],[44,15,44,20],[37,12,37,20],[44,8,44,12],[35,12,35,20],[39,16,40,20],[39,12,40,15],[54,4,54,6],[42,4,42,19]]}
[null,null,null,null,null,"A","G",null,null,"A","G",null,null,"A","G",null,null,null,"A","G","Group"]
[{"$f":"COLUMN()","v":1},null,null,null,null,null,null,null,null,null,null,null,null,null,null,null,null,null,null,null,"Global"]
[null,null,null,null,null,null,null,null,null,null,null,null,null,null,null,null,null,null,null,"PROTÉGÉ A (lorsque rempli)"]
[null,null,null,null,null,null,null,null,null,null,null,"Modèle pour la répartition – voir BVG Audit 2333 à 2334"]
[null,null,null,null,"Seuil de signification du groupe",null,null,null,"Nom : "]
[]
[null,null,null,null,null,null,null,null,"Date de clôture : "]
[]
[null,null,null,null,"Seuil de signification global du groupe (obligatoire)"]
[]
[null,"a",null,null,"* * * Sélection de l’élément de référence approprié * * *",null,null,null,null,null,null,null,"* * * Sélectionnez l’élément de référence approprié avant de sélectionner la justification * * *"]
[]
[null,null,null,null,null,null,null,null,null,null,"Autre (si applicable):"]
[]
[null,"b",null,null,"Entrer la règle empirique  %",null,null,null,null,null,"Justification:"]
[]
[null,"c = a x b",null,null,"Seuil de signification global du groupe calculé",null,null,null,{"$f":"ABS(I11*I15)","v":0}]
[]
[null,null,null,null,"Entrer le seuil de signification global du groupe"]
[]
[null,null,null,null,"Seuil de signification pour les travaux du groupe (obligatoire)"]
[]
[null,null,null,null,null,null,null,null,null,null,null,null,"        Facteurs de détermination du seuil de signification pour les travaux"]
[null,"d",null,null,"Entrer le % de la réduction pour le groupe",null,null,null,null,null,null,null,"* * * Sélection de la fréquence des ajustements d’audit des exercices précédents * * *"]
[]
[null,null,null,null,"Seuil de signification pour les travaux du groupe calculé",null,null,null,{"$f":"I19*(1-I24)","v":0},null,null,null,"* * * Sélection du risque global de la mission * * *"]
[]
[null,"e= c x d",null,null,"Entrer le seuil de signification pour les travaux du groupe",null,null,null,null,null,null,null,"Autres facteurs qui ont une incidence sur la réduction :"]
[]
[]
{"$rows_left_out":82}
{"sheet":"Sheet1","index":1,"n_rows":0,"n_cols":0,"rows_kept":0,"cut":false,"hidden":false,"merged":[]}

{"sheet":"Données sur les composantes","index":2,"n_rows":410,"n_cols":8,"rows_kept":410,"cut":false,"hidden":false,"merged":[[8,6,9,6],[8,7,9,7],[5,3,5,4],[7,3,7,5],[3,3,3,5],[5,6,5,7],[6,6,6,7],[7,6,7,7]]}
[{"$f":"COUNTA(D11:D682)","v":0},null,null,{"$f":"SUM(E11:E682)","v":0},null,null,null,"PROTÉGÉ A (lorsque rempli)"]
[null,null," "]
[null,null,null,"Instructions"]
[null,null,null,"1.) L’information sur les composantes individuelles est entrée dans cet onglet. Cette information sera reportée dans l’onglet « Analyse des composantes » lorsque les données auront été entrées. Coller (ou entrer) les données sur les composantes (sans inclure les titres, les totaux partiels ou les totaux) dans le champ ombré. Il n’est pas nécessaire d’identifier spécifiquement les filiales non significatives sur cette feuille; elles peuvent être consignées ensemble dans le champ « Toutes les autres composantes » ou peuvent être omises des données.\nChaque composante est entrée dans la colonne Nom des composantes. Il faut entrer dans la colonne Élément de référence 1 l’information pour chaque composante dont l’élément de référence est le même que pour le groupe (voir l’onglet « Seuil de sig. du groupe »). L’utilisation de la colonne Élément de référence 2 est facultative. On peut y entrer les autres éléments de référence aux fins de comparaison, p. ex. les actifs ou les produits. Indiquer le nom de l’élément de référence dans le champ surligné en jaune [Entrer le nom], p. ex. Actifs.\n2.) Cliquer sur le bouton « Entrée des données terminée » lorsque vous aurez fini d’entrer les données.\n3.) S’il faut corriger les données après avoir cliqué sur le bouton « Entrée des données terminée », cliquer sur le bouton « Réviser les données ». \nLes corrections seront reportées également sur les feuilles Analyse des composantes et Seuil de sig. des composantes.\n4.) Cliquer sur « Supprimer les données sur les composantes » pour supprimer toutes les données sur les composantes de cette feuille et de toutes les feuilles de travail.\n5). Les colonnes portant le titre MP et Explications peuvent servir à entrer des marques de pointage et les explications correspondantes."]
[]
[null,null,null,"Feuille de données sur les composantes",null,null,"Différence entre le total inscrit pour l'élément de référence principal sur l'onglet 'Seuil de sig. Du groupe' et le total inscrit pour les composantes énumérées ci-dessous"]
[null,null,null,null,null,null,{"$f":"Grp_Bench-(SUM(E10:E408))","v":0}]
[null,null,null,"DONNÉES DES COMPOSANTES POUR RÉPARTITION"]
[null,null,null,"À noter - Le nombre de composantes entré dans cette colonne est directement utilisé dans le calcul du multiplicateur","Élément de référence 1 - Élément de référence utilisé pour calculer le seuil de signification du groupe","Élément de référence 2 - Élément de référence alternative (facultatif)","MP","Explications"]
[null,null,null,"Nom des composantes",{"$f":"IF(LEFT('Seuil de sig. du groupe'!E11)=\"*\",\"[Entrer le nom]\",IF(LEFT('Seuil de sig. du groupe'!E11,6)=\"Others\",IF(LEFT('Seuil de sig. du groupe'!#REF!,5)=\"Enter\",\"[Enter Name]\",'Seuil de sig. du groupe'!#REF!), 'Seuil de sig. du groupe'!E11))","v":"[Entrer le nom]"},"[Entrer Nom]"]
[11,{"$f":"IF(D11=\"\",\"\",ROW())","v":""},{"$f":"ROW()-10","v":1}]
[12,"",2]
[13,"",3]
[14,"",4]
[15,"",5]
[16,"",6]
[17,"",7]
[18,"",8]
[19,"",9]
[20,"",10]
[21,"",11]
[22,"",12]
[23,"",13]
[24,"",14]
["","",15]
["","",16]
["","",17]
["","",18]
["","",19]
["","",20]
{"$rows_left_out":381}
{"sheet":"Analyse des composantes","index":3,"n_rows":417,"n_cols":65,"rows_kept":417,"cut":false,"hidden":false,"merged":[[25,17,25,18],[25,20,25,21],[24,23,24,25],[24,29,24,30],[24,32,24,49],[16,13,18,18],[23,23,23,25],[8,14,13,26],[24,14,24,21],[7,29,8,48],[6,56,6,61],[25,29,25,30],[25,57,25,58],[9,51,13,58],[7,51,8,58],[24,55,24,56],[9,29,13,48]]}
[null,null,null,null,null,"Live Update:",false,null,"Valid 1",null,null,null,null,null,null,"CO","T","SBT","PT","T","SBT","PT","T",null,null,null,null,null,null,"SBT","PT","T","SBT","T","SBT","T","SBT","T","SBT","T","SBT","T","SBT","T","SBT","T","SBT","T","SBT","PT",null,null,null,"HR","T","SBT","T","SBT","PT","T","MAX"]
[null,{"$f":"COLUMN()","v":2},{"$f":"COLUMN()","v":3},{"$f":"COLUMN()","v":4},null,{"$f":"COLUMN()","v":6},null,null,"Valid 2",null,{"$f":"COLUMN()","v":11},null,{"$f":"COLUMN()","v":13},"TM",{"$f":"COLUMN()","v":15},{"$f":"COLUMN()","v":16},null,{"$f":"COLUMN()","v":18},{"$f":"COLUMN()","v":19},null,{"$f":"COLUMN()","v":21},{"$f":"COLUMN()","v":22},null,null,null,null,null,null,null,{"$f":"COLUMN()","v":30},null,null,{"$f":"COLUMN()","v":33},null,{"$f":"COLUMN()","v":35},null,null,null,null,null,null,null,null,null,null,null,{"$f":"COLUMN()","v":47},null,{"$f":"COLUMN()","v":49},null,null,null,null,{"$f":"COLUMN()","v":54},null,{"$f":"COLUMN()","v":56},null,{"$f":"COLUMN()","v":58},null,null,{"$f":"COLUMN()","v":61},null,null,{"$f":"COLUMN()","v":64},{"$f":"COLUMN()","v":65}]
[{"$f":"IF(ROW()<27,0,IF(C3<>\"\",MAX(A$1:A2)+1,\"\"))","v":0},null,{"$f":"IF(AND(D3=\"\",OR(P3<>\"\",R3<>\"\",U3<>\"\")),IF(AND(X3=FALSE,Y3=FALSE,Z3=FALSE),1000,IF(Z3=TRUE,2000,2000))+ROW(),\"\")","v":""},null,{"$f":"IF(OR(B3=\"Blank\",B3=\"SBT\"),D3,C3)","v":""},1028,{"$f":"IF(LEFT(E3,1)<>LEFT(F3,1),1,0)","v":1},null,null,null,null,null,null,{"$f":"IF(OR(Q3<>\"\",T3<>\"\",W3<>\"\",AF3<>\"\",AH3<>\"\",AJ3<>\"\",AL3<>\"\",AN3<>\"\",AP3<>\"\",AR3<>\"\",AT3<>\"\",AV3<>\"\",AY3<>\"\",BC3<>\"\",BE3<>\"\",BH3<>\"\"),\"TM\",\"\")","v":""},{"$f":"A3","v":0},null,null,null,"??",null,null,"??",null,null,null,null,null,null,{"$f":"O3","v":0},null,null,null,null,null,null,null,null,null,null,null,null,null,null,null,null,null,null,null,null,null,null,null,{"$f":"O3","v":0}]
[null,null,null,null,null,null,null,null,null,null,null,null,null,null,null,null,null,null,null,null,null,null,null,null,null,null,null,null,null,0,null,null,true,null,{"$f":"SUM(ABS(AD28:AD29))","v":0},null,"ADJ_1",null,"ADJ_2",null,"ADJ_3",null,"ADJ_4",null,"ADJ_5",null,null,null,null,null,null,null,null,{"$f":"COUNTIF(#REF!,\"<>Grp_Hair\")","v":{"$error":"#REF!"}}]
[null,null,null,null,null,null,null,null,null,null,null,null,null,null,{"$f":"COUNTIF(F10:F34,\"<1999\")-2","v":0},null,null,null,null,null,null,null,null,null,null,null,null,null,null,{"$f":"4+AD4","v":4},null,null,null,null,null,null,1]
[2,null,null,null,null,null,null,null,null,null,"Name:",null,null,null,null,null,null,null,null,null,null,null,null,null,null,null,null,null,null,null,null,null,null,null,null,null,null,null,{"$f":"SUBTOTAL(9,AM16:AM65536)","v":0},null,{"$f":"SUBTOTAL(9,AO16:AO65536)","v":0},null,{"$f":"SUBTOTAL(9,AQ16:AQ65536)","v":0}]
[null,null,null,null,null,null,null,null,null,null,null,null,null,null,null,null,null,null,null,null,null,null,null,null,null,null,null,null,null,null,null,null,null,null,null,null,null,null,null,null,null,null,null,null,null,null,null,null,null,null,null,null,null,null,null,null,"PROTÉGÉ A (lorsque rempli)"]
[null,null,null,null,null,null,null,null,null,null,null,null,null,null,"Remplir les feuilles Seuil de signification du groupe et Données sur les composantes avant de commencer l’Analyse des composantes",null,null,null,null,null,null,null,null,null,null,null,null,null,null,"Feuille d’Analyse des composantes – Sélectionner la méthode de répartition, arrondir les montants répartis et apporter les autres ajustements nécessaires.",null,null,null,null,null,null,null,null,null,null,null,null,null,null,null,null,null,null,null,null,null,"Analyse des composantes – Appliquer la réduction au seuil de signification pour les travaux"]
[null,null,null,null,null,null,null,null,null,null,null,null,null,null,"Analyse des composantes – Dans cette section, vous devez trier les composantes en catégories en vue de la répartition du seuil de signification. Les colonnes d’information sur les composantes contiennent déjà l’information que vous avez entrée dans les deux colonnes des éléments de référence de la feuille « Données sur les composantes ».\n- Facteurs d’exclusion des composantes – Sélectionner les facteurs d’exclusion des composantes pertinents pour chaque composante à exclure des composantes du cadre de répartition. Cliquer sur n’importe laquelle des trois cases (ou sur toutes les cases) qui sont pertinentes pour chaque composante. Si vous cliquez sur une case d’exclusion, la composante sera exclue de la répartition initiale du seuil de signification global du groupe au moyen du multiplicateur. Cette étape peut ne pas apparaître si toutes les composantes qui ne seront incluses dans la répartition ont déjà été exclues dans l’onglet Données pour la répartition.\n- Cliquer sur « Trier les composantes » et revoir les catégories de composantes. Les composantes classées dans la section du haut « Incluses dans la répartition » seront incluses dans le calcul. Les composantes classées dans la section du bas « Non incluses dans la répartition » ne seront pas incluses dans le calcul.\n- S’il est nécessaire d’ajuster les catégories de certaines composantes, réviser les cases  Facteurs d’exclusion des composantes et cliquer de nouveau sur « Trier les composantes ».\n- Cliquer sur « Réviser les données » pour modifier les Données sur les composantes. Ces changements apparaîtront aussi dans la feuille de travail « Données sur les composantes ».\n- Les colonnes portant le titre MP peuvent être utilisées pour les marques de pointage. Un champ est prévu en bas des calculs pour expliquer les marques de pointage.\n"]
[null,null,null,null,null,null,null,null,null,null,null,null,null,null,null,null,null,null,null,null,null,null,null,null,null,null,null,null,null,"- Cliquer sur « Sélectionner un autre élément de référence pour la répartition », puis sélectionner l’élément de référence à utiliser pour la répartition dans le menu déroulant. La sélection comprend l’élément ou les éléments de référence entré(s) sur la feuille de travail « Données sur les composantes »; cependant, on utilisera généralement l’élément de référence sélectionné pour le seuil de signification global du groupe (qui est déjà entré). La répartition tient compte du nombre de composantes dans la catégorie « Incluses dans la répartition » et applique le multiple approprié du seuil de signification global dans le calcul. Le pourcentage en haut de la colonne est le multiplicateur du seuil de signification. (Voir le bouton des directives sur le multiple du Seuil de signification).\n- Revoir la répartition initiale du montant total du Seuil de signification global des composantes (c’est le seuil de signification du groupe  X le multiplicateur approprié selon le nombre de composantes).\n- Cliquer sur « ajustement de l’arrondissement », puis sélectionner le facteur d’arrondissement automatique ou l’arrondissement manuel.\n- Entrer les ajustements dans la colonne Ajustement. Cliquer sur « Ajustement(s) supplémentaire(s) » pour ajouter jusqu’à quatre autres colonnes d’ajustement. Les colonnes d’ajustement supplémentaires permettent de consigner les ajustements séparément et de donner un titre à chaque colonne (tel que risque, audits exigées par la loi, etc.) ou utiliser les marques de pointage pour expliquer les ajustements.\n- Déterminer si les ajustements totaux (y compris les arrondissements) et le seuil de signification global des composantes sont raisonnables.",null,null,null,null,null,null,null,null,null,null,null,null,null,null,null,null,null,null,null,null,null,"-Cliquer sur « Réduction du seuil de signification pour les travaux » et sélectionner la « réduction du groupe » à appliquer à toutes les composantes ou sélectionner la « réduction adaptée à chaque composante », ce qui permet d’entrer un % de réduction distinct pour chaque composante. Si vous choisissez d’entrer une réduction adaptée à chaque composante, la réduction du groupe va tout d’abord apparaître dans les cellules et vous pourrez ensuite ajuster chaque réduction individuellement. Il faut consigner la justification des réductions adaptées qui diffèrent significativement de la réduction du groupe. Une fois l’adaptation des réductions terminée, le nombre de composantes comportant une réduction adaptée qui diffère de la réduction du groupe apparaîtra dans la page du sommaire du « Seuil de signification des composantes ».\n-Déterminer si le seuil de signification pour les travaux des composantes est raisonnable."]
[]
[]
[]
[]
[]
[]
[null,null,null,null,null,null,null,null,null,null,null,null,null,"Feuille de travail des composantes"]
[]
[]
[]
[]
[]
[]
[null,null,null,null,null,null,null,null,null,null,null,null,null,null,null,null,null,null,null,null,null,null,null,{"$f":"IF(AND(G1=FALSE,SUM($G$20:$G$33)>0),\"Une fois terminé, cliquer sur 'Trier les composantes'!\",\"\")","v":""}]
[null,null,null,null,null,null,null,null,null,null,null,null,null,null,"Information sur les composantes",null,null,null,null,null,null,null,null,"Facteurs d'exclusion des composantes",null,null,null,null,null,null,null,null,"Total des seuils de signification globaux répartis"]
[null,null,null,"Delete",null,"Start","Change?",null,null,null,"Unique",null,null,true,"#","Seuil de signification des composantes déterminé par",null,{"$f":"'Données sur les composantes'!E10","v":"[Entrer le nom]"},null,"MP",{"$f":"'Données sur les composantes'!F10","v":"[Entrer Nom]"},null,"MP","Sans conséquence sur les données financières","Centres de services partagés","Peu ou pas de procédures d'audit","MP",null,"#","[Choisir la méthode de répartition]",null,"MP","Répartition initiale",null,{"$f":"\"Répartition arrondie\"&IF(AND(Rnd_Man=\"\"),\" [\"&Rnd_Val&\"]\",\"\")","v":"Répartition arrondie [10,000]"},"MP","[Nom de l'ajustement]","MP","[Nom de l'ajustement]","MP","[Nom de l'ajustement]","MP","[Nom de l'ajustement]","MP","[Nom de l'ajustement]","MP","Ajustements totaux ","MP","Seuil de signification global des composantes","%","MP",null,"#","% Réduction","MP","Réduction du seuil de signification pour les travaux","MP","Seuil de signification  pour les travaux des composantes",null,"MP"]
[0,"SBT",{"$f":"IF(AND(D27=\"\",OR(P27<>\"\",R27<>\"\",U27<>\"\")),IF(AND(#REF!=FALSE,Y27=FALSE,Z27=FALSE),1000,2000)+ROW(),\"\")","v":""},999,{"$f":"IF(OR(B27=\"Blank\",B27=\"SBT\"),D27,C27)","v":999},999,null,null,null,{"$f":"SMALL($F$20:$F$33,1)","v":999},null,null,null,true,null,null,null,"HUF","%",null,"HUF","%",null,null,null,null,null,null,null,"HUF","%",null,{"$f":"+'Seuil de sig. des composantes'!T25","v":0},null,"HUF",null,null,null,null,null,null,null,null,null,null,null,"HUF",null,"HUF",null,null,null,null,null,null,"HUF",null,"HUF","%"]
[{"$f":"IF(C28<>\"\",MAX(A$27:A27)+1,\"\")","v":""},"Blank",{"$f":"IF(AND(D28=\"\",OR(P28<>\"\",R28<>\"\",U28<>\"\")),IF(AND(X28=FALSE,Y28=FALSE,Z28=FALSE),1000,2000)+ROW(),\"\")","v":""},1000,1000,1000,{"$f":"IF(LEFT(E28,1)<>LEFT(F28,1),1,0)","v":0},null,null,null,null,null,null,null,null,"Incluses dans la répartition",null,null,null,null,null,null,null,{"$f":"\"---\"","v":"---"},"---","---",null,null,null,null,null,null,null,null,null,null,null,null,null,null,null,null,null,null,null,null,null,null,null,null,null,null,null,null,null,null,null,null,null,null,null,null,null,"Determined by Allocation"]
[{"$f":"IF(C29<>\"\",MAX(A$27:A28)+1,\"\")","v":""},"SBT",{"$f":"IF(AND(D29=\"\",OR(P29<>\"\",R29<>\"\",U29<>\"\")),IF(AND(X29=FALSE,Y29=FALSE,Z29=FALSE),1000,2000)&\" \"&P29,\"\")","v":""},1999,1999,1999,0,null,null,null,"",null,null,null,null,null,null,{"$f":"SUBTOTAL(9,R28:R28)","v":0},{"$f":"IF(R$33=0,\"\",R29/R$33)","v":""},null,{"$f":"SUBTOTAL(9,U28:U28)","v":0},{"$f":"IF(U$33=0,\"\",U29/U$33)","v":""},null,"---","---","---",null,null,null,{"$f":"SUBTOTAL(9,AD28:AD28)","v":0},{"$f":"IF(AD$33=0,\"\",AD29/AD$33)","v":""},null,{"$f":"SUBTOTAL(9,AG28:AG28)","v":0},null,{"$f":"SUBTOTAL(9,AI28:AI28)","v":0},null,{"$f":"SUBTOTAL(9,AK28:AK28)","v":0},null,{"$f":"SUBTOTAL(9,AM28:AM28)","v":0},null,{"$f":"SUBTOTAL(9,AO28:AO28)","v":0},null,{"$f":"SUBTOTAL(9,AQ28:AQ28)","v":0},null,{"$f":"SUBTOTAL(9,AS28:AS28)","v":0},null,{"$f":"SUBTOTAL(9,AU28:AU28)","v":0},null,{"$f":"SUBTOTAL(9,AW28:AW28)","v":0},{"$f":"IF(AW$33=0,\"\",AW29/AW$33)","v":""},null,null,null,null,null,{"$f":"SUBTOTAL(9,BD28:BD28)","v":0},null,{"$f":"SUBTOTAL(9,BF28:BF28)","v":0},{"$f":"IF(BF$29=0,\"\",BF29/BF$29)","v":""}]
[{"$f":"IF(C30<>\"\",MAX(A$27:A29)+1,\"\")","v":""},"Blank",{"$f":"IF(AND(D30=\"\",OR(P29<>\"\",R30<>\"\",U30<>\"\")),IF(AND(X30=FALSE,#REF!=FALSE,Z30=FALSE),1000,2000)&\" \"&P29,\"\")","v":""},2000,2000,2000,0,null,null,null,"",null,null,null,null,"Non-incluses dans la répartition",null,null,{"$f":"IF(U30<>\"\",MAX(S$27:S29)+1,\"\")","v":""},null,null,null,null,"---","---","---",null,null,null,null,null,null,null,null,null,null,null,null,null,null,null,null,null,null,null,null,null,null,null,null,null,null,null,null,null,null,null,null,null,null,null,null,null,"Determined by Professional Judgment"]
{"$rows_left_out":388}
{"sheet":"Seuil de sig. des composantes","index":4,"n_rows":59,"n_cols":22,"rows_kept":59,"cut":false,"hidden":false,"merged":[[8,19,8,21],[18,10,18,15],[43,17,43,19],[22,10,22,15],[26,11,26,15],[28,10,28,15],[24,11,24,15],[42,17,42,19],[20,10,20,15],[39,10,39,21],[40,10,40,21],[10,10,12,12],[10,15,10,21],[16,10,16,15],[12,15,12,16],[14,9,14,22],[12,20,12,21],[48,9,48,10],[50,9,50,10],[30,10,30,15],[34,11,34,15],[32,11,32,15],[36,10,36,15],[38,9,38,22]]}
[44,null,null,null,null,null,null,null,null,null,11,12,null,{"$f":"N2-4","v":29},null,{"$f":"P2-4","v":45},null,{"$f":"R2-4","v":50},null,{"$f":"T2-4","v":52},null,{"$f":"V2-4","v":54}]
[null,null,null,null,null,null,null,null,null,"Actual",15,16,null,33,null,49,null,54,null,56,null,58]
[null,{"$f":"SMALL('Analyse des composantes'!$E$20:$E34,ROW()-$A$1)","v":{"$error":"#NUM!"}},{"$f":"IF(ISERROR(B3),\"N\",IF(OR(B3=\"\",B3>4999),\"N\",\"Y\"))","v":"N"},{"$f":"IF(C3=\"N\",\"\",IF(AND(C3=\"Y\",B3>3000,B3<>4999),\"YN\",\"\"))","v":""},{"$f":"IF(C3=\"Y\",IF(OR(RIGHT(B3,3)=\"000\"),\"H\",IF(RIGHT(B3,3)=\"999\",\"B\",\"\")),\"\")","v":""},null,null,null,null,null,{"$f":"IF(AND(C3<>\"N\",E3<>\"H\",E3<>\"B\"),VLOOKUP($B3,'Analyse des composantes'!$E:$IT,K$1,FALSE),\"\")","v":""},{"$f":"IF(AND($C3=\"Y\",$E3<>\"B\",B3<4000),VLOOKUP($B3,'Analyse des composantes'!$E:$IT,L$1,FALSE),\"\")","v":{"$error":"#NUM!"}},null,{"$f":"IF(AND($C3=\"Y\",$E3<>\"H\",D3<>\"YN\"),VLOOKUP($B3,'Analyse des composantes'!$E:$IT,N$1,FALSE),\"\")","v":""},null,{"$f":"IF(AND($C3=\"Y\",$E3<>\"H\",G3<>\"YN\"),VLOOKUP($B3,'Analyse des composantes'!$E:$IT,P$1,FALSE),\"\")","v":""},null,{"$f":"IF(AND($C3=\"Y\",$E3<>\"H\",I3<>\"YN\"),VLOOKUP($B3,'Analyse des composantes'!$E:$IT,R$1,FALSE),\"\")","v":""},null,{"$f":"IF(AND($C3=\"Y\",$E3<>\"H\",K3<>\"YN\"),VLOOKUP($B3,'Analyse des composantes'!$E:$IT,T$1,FALSE),\"\")","v":""},null,{"$f":"IF(AND($C3=\"Y\",$E3<>\"H\",M3<>\"YN\"),VLOOKUP($B3,'Analyse des composantes'!$E:$IT,V$1,FALSE),\"\")","v":""}]
[]
[null,null,null,null,null,null,null,{"$f":"COLUMN()","v":8}]
[]
[]
[]
[null,null,null,null,null,null,null,null,null,null,null,null,null,null,null,null,null,null,null,"PROTÉGÉ A (lorsque rempli)"]
[]
[null,null,null,null,null,null,null,null,null,null,"Seuil de signification des composantes",null,null,"Nom","Engagement: ",{"$f":"IF(Eng_Nm=\"\",\"Entrer le titre de la mission sur la feuille de travail du seuil de signification du groupe\",Eng_Nm)","v":"Entrer le titre de la mission sur la feuille de travail du seuil de signification du groupe"}]
[]
[null,null,null,null,null,null,null,null,null,null,null,null,null,null,"Date de clôture :",{"$f":"IF(OR(YE=\"JJ/MM/AAAA\", YE=\"\"),\"Entrer la date de clôture\",YE)","v":"Entrer la date de clôture"},null,null,null,null,"PRÊT POUR LA REVUE"]
[]
[null,null,null,null,null,null,null,null,null,"Sommaire du seuil de signification des composantes                              L'information de ce sommaire est prise des autres onglets de ce document."]
[]
[null,null,null,null,null,null,null,null,null,null,"Seuil de signification global du groupe [de la feuille de travail Seuil de signification du groupe]",null,null,null,null,null,null,null,null,{"$f":"Grp_Mat","v":0}]
[]
[null,null,null,null,null,null,null,null,null,null,"Nombre de composantes incluses dans la répartition [de la feuille de travail Analyse des composantes]",null,null,null,null,null,null,null,null,{"$f":"Comp_Numb","v":0}]
[]
[null,null,null,null,null,null,null,null,null,null,"Nombre de composantes qui ne sont pas incluses dans la répartition [de la feuille de travail Analyse des composantes]",null,null,null,null,null,null,null,null,{"$f":"COUNTA('Données sur les composantes'!D11:D393)-T19","v":0}]
[]
[null,null,null,null,null,null,null,null,null,null,"Total du seuil de signification global des composantes :"]
[]
[null,null,null,null,null,null,null,null,null,null,null,"Multiple du seuil de signification global du groupe [table dans BVG Audit 2334]",null,null,null,null,null,null,null,{"$f":"IF(ISERROR(Comp_Mult),0,Comp_Mult)","v":0}]
[]
[null,null,null,null,null,null,null,null,null,null,null,"Montant total du seuil de signification global des composantes [seuil de signification global du groupe x multiple du seuil de signification global du groupe]",null,null,null,null,null,null,null,{"$f":"T25*T17","v":0}]
[]
[null,null,null,null,null,{"$f":"VLOOKUP(1999,$B$40:$Y$1965,15,FALSE)","v":{"$error":"#N/A"}},null,null,null,null,"Somme des seuils de signification globaux des composantes ajustés de la répartition [de la feuille de travail Analyse des composantes]",null,null,null,null,null,null,null,null,{"$f":"IF(ISERROR(F29),0,F29)","v":0},"[voir précisions ci-dessous]"]
[]
{"$rows_left_out":30}
{"sheet":"SecurityLabel","index":5,"n_rows":10,"n_cols":1,"rows_kept":10,"cut":false,"hidden":true,"merged":[]}
["UNCLASSIFIED"]
["NON CLASSIFIÉ"]
["PROTECTED A"]
["PROTÉGÉ A"]
["PROTECTED B"]
["PROTÉGÉ B"]
["PROTECTED A (when completed)"]
["PROTÉGÉ A (lorsque rempli)"]
["PROTECTED B (when completed)"]
["PROTÉGÉ B (lorsque rempli)"]

{"sheet":"Round","index":6,"n_rows":2,"n_cols":2,"rows_kept":2,"cut":false,"hidden":true,"merged":[]}
[]
["10,000","Round Value"]

{"sheet":"Comp_Mult_Calc","index":7,"n_rows":19,"n_cols":6,"rows_kept":19,"cut":false,"hidden":true,"merged":[[5,0,5,1]]}
[{"$f":"Comp_Numb","v":0}]
[]
[{"$f":"IF(ISERROR(A1),0,VLOOKUP(A1,A8:C17,3,TRUE))","v":{"$error":"#N/A"}}]
[]
[]
["Component Range"]
["Min","Max","Multiple",0.5,0.25,0.1]
[1,null,1]
[2,null,1.57,1.5,1.8,1.9]
[3,null,2.11,2,2.5,2.9]
[4,null,3.11,3,3.5,3.75]
[5,null,3.24,3,4,4.75]
[6,10,3.24,3,4,5]
[11,20,4.2300000000000004,4,5,6]
[21,50,5.23,5,6,7]
[51,75,6.23,6,7,8]
[76,100,7.23,7,8,9]
[101,125,8.23,8,9,10]
[126,null,9.23,9,10,11]