{"text_format":"1","workbook":"xlsx","n_sheets":8,"sheets":["Group Materiality","Component Data","Component Analysis","Component Materiality","Sheet1","SecurityLabel","Round","Comp_Mult_Calc"],"not_rendered":{"charts":0,"images":31,"macros":1,"external_links":0,"defined_names":55,"comments":1,"pivot_tables":0},"unopened":[],"bounds":{"document_bytes":16777216,"sheet_cells":100000,"rows_first":2000,"rows_last":500,"rows_between":2000,"halvings":0,"cell_chars":16384,"cell_head_chars":4096},"cells_cut":0,"cells_raw":0,"read":"whole","date_system":"1900"}

{"sheet":"Group Materiality","index":0,"n_rows":111,"n_cols":21,"rows_kept":111,"cut":false,"hidden":false,"merged":[[2,17,2,20],[39,16,40,20],[39,12,40,15],[14,15,18,20],[20,4,20,20],[25,12,25,20],[23,12,23,20],[10,12,10,20],[8,4,8,20],[4,4,6,7],[6,11,6,12],[4,11,4,19],[12,15,12,20],[27,12,28,14],[27,15,28,20],[52,15,56,20],[30,4,30,20],[33,12,33,20],[42,4,42,20],[48,8,48,20],[50,4,50,20],[49,8,49,12],[44,15,44,20],[37,12,37,20],[44,8,44,12],[35,12,35,20]]}
[null,null,null,null,null,"A","G",null,null,"A","G",null,null,"A","G",null,null,null,"A","G","Group"]
[{"$f":"COLUMN()","v":1},null,null,null,null,null,null,null,null,null,null,null,null,null,null,null,null,null,null,null,"Global"]
[null,null,null,null,null,null,null,null,null,null,null,null,null,null,null,null,null,"PROTECTED A (when completed)"]
[null,null,null,null,null,null,null,null,null,null,null,"Allocation Template - See OAG Audit 2333 to 2334"]
[null,null,null,null,"Group Materiality",null,null,null,"Name: "]
[]
[null,null,null,null,null,null,null,null,"Year End: "]
[]
[null,null,null,null," Group Overall Materiality (required)"]
[]
[null,"a",null,null,"* * * Select appropriate benchmark * * *",null,null,null,null,null,null,null,"* * * Select appropriate benchmark before selecting rationale * * *"]
[]
[null,null,null,null,null,"  (Type Benchmark Here)",null,null,null,null,null,null,"Other (if applicable): "]
[]
[null,"b",null,null,"Enter rule of thumb %",null,null,null,null,null,null,null,"Rationale:"]
[]
[null,"c = a x b",null,null,"Overall group materiality calculated",null,null,null,{"$f":"ABS(I11*I15)","v":0}]
[]
[null,null,null,null,"Enter group overall materiality"]
[]
[null,null,null,null,"Group Performance Materiality (required)"]
[]
[null,null,null,null,null,null,null,null,null,null,null,null,"                                      Factors to determine the performance materiality"]
[null,"d",null,null,"Enter group haircut %",null,null,null,null,null,null,null,"* * * Select frequency of prior audit adjustments * * * "]
[]
[null,null,null,null,"Group performance materiality calculated",null,null,null,{"$f":"I19*(1-I24)","v":0},null,null,null,"* * * Select overall engagement risk * * * "]
[]
[null,"e= c x d",null,null,"Enter group performance materiality",null,null,null,null,null,null,null,"Others factors that \naffect haircut: "]
[]
[]
{"$rows_left_out":82}
{"sheet":"Component Data","index":1,"n_rows":410,"n_cols":8,"rows_kept":410,"cut":false,"hidden":false,"merged":[[8,6,9,6],[8,7,9,7],[5,3,5,4],[7,3,7,5],[3,3,3,5],[5,6,5,7],[6,6,6,7]]}
[{"$f":"COUNTA(D11:D682)","v":0},null,null,{"$f":"SUM(E11:E682)","v":0}]
[null,null,null,null,null,null,null,"PROTECTED A (when completed)"]
[null,null," ","Instructions:"]
[null,null,null,"1.) Information for individual components is entered on this tab.  This information will flow through to the \"Component Analysis\" tab when data input is complete.  Paste (or enter) the component data (not including headers, subtotals, or totals) in the shaded area. Non-significant subsidiaries do not need to be specifically identified on the worksheet; they can be documented together as \"All other components\" or they may be omitted from the data input.\nComponent Name column identifies the individual components. Benchmark 1 column should be populated with information for each component that is consistent with the benchmark chosen for the group (See the \"Group Materiality\" tab).  Benchmark 2 column is optional and may be populated with other benchmarks for comparative purposes, e.g. Assets or Revenue. Fill in the name of the benchmark in the yellow highlighted area [Enter Name], e.g. Assets.\n2.) Click the \"Data Input Complete\" button when you have finished entering data.\n3.) If an edit to the data is necessary after the \"Data Input Complete\" button is clicked, click the \"Edit Data\" button. \nThese edits will affect data on the Component Analysis and Component Materiality worksheets as well.\n4.) Click \"Clear Component Data\" to remove all component data from this and all worksheets.\n5). The columns labeled TM and Explanations may be used for tickmarks and corresponding explanations."]
[]
[null,null,null,"Component Data Input Sheet",null,null,"Difference between total entered for primary benchmark on 'Group Materiality' tab and total entered for components listed below."]
[null,null,null,null,null,null,{"$f":"Grp_Bench-(SUM('Component Data'!E11:E410))","v":0}]
[null,null,null,"COMPONENT DATA FOR ALLOCATION"]
[null,null,null,"Note - The number of components entered in this column is directly used in the multiplier calculation","Benchmark 1 - Benchmark used to calculate group materiality","Benchmark 2 - Alternative benchmark (optional)","TM","Explanation"]
[null,null,null,"Component Name",{"$f":"IF(LEFT('Group Materiality'!E11)=\"*\",\"[Enter Name]\",IF(LEFT('Group Materiality'!E11,6)=\"Others\",IF(LEFT('Group Materiality'!E13,5)=\"Enter\",\"[Enter Name]\",'Group Materiality'!E13), 'Group Materiality'!E11))","v":"[Enter Name]"},"[Enter Name]"]
[11,{"$f":"IF(D11=\"\",\"\",ROW())","v":""},{"$f":"ROW()-10","v":1}]
["","",2]
["","",3]
["","",4]
["","",5]
["","",6]
["","",7]
["","",8]
["","",9]
["","",10]
["","",11]
["","",12]
["","",13]
["","",14]
["","",15]
["","",16]
["","",17]
["","",18]
["","",19]
["","",20]
{"$rows_left_out":381}
{"sheet":"Component Analysis","index":2,"n_rows":417,"n_cols":65,"rows_kept":417,"cut":false,"hidden":false,"merged":[[6,56,6,59],[25,20,25,21],[24,57,24,58],[24,53,24,55],[24,23,24,25],[24,29,24,30],[24,32,24,49],[25,29,25,30],[25,57,25,58],[24,14,24,21],[25,17,25,18],[8,29,13,50],[8,53,13,60],[16,13,18,18],[23,23,23,25],[8,14,13,26]]}
[null,null,null,null,null,"Live Update:",false,null,"Valid 1",null,null,null,null,null,null,"CO","T","SBT","PT","T","SBT","PT","T",null,null,null,null,null,null,"SBT","PT","T","SBT","T","SBT","T","SBT","T","SBT","T","SBT","T","SBT","T","SBT","T","SBT","T","SBT","PT",null,null,null,"HR","T","SBT","T","SBT","PT","T","MAX"]
[null,{"$f":"COLUMN()","v":2},{"$f":"COLUMN()","v":3},{"$f":"COLUMN()","v":4},null,{"$f":"COLUMN()","v":6},null,null,"Valid 2",null,{"$f":"COLUMN()","v":11},null,{"$f":"COLUMN()","v":13},"TM",{"$f":"COLUMN()","v":15},{"$f":"COLUMN()","v":16},null,{"$f":"COLUMN()","v":18},{"$f":"COLUMN()","v":19},null,{"$f":"COLUMN()","v":21},{"$f":"COLUMN()","v":22},null,null,null,null,null,null,null,{"$f":"COLUMN()","v":30},null,null,{"$f":"COLUMN()","v":33},null,{"$f":"COLUMN()","v":35},null,null,null,null,null,null,null,null,null,null,null,{"$f":"COLUMN()","v":47},null,{"$f":"COLUMN()","v":49},null,null,null,null,{"$f":"COLUMN()","v":54},null,{"$f":"COLUMN()","v":56},null,{"$f":"COLUMN()","v":58},null,null,{"$f":"COLUMN()","v":61},null,null,{"$f":"COLUMN()","v":64},{"$f":"COLUMN()","v":65}]
[{"$f":"IF(ROW()<27,0,IF(C3<>\"\",MAX(A$1:A2)+1,\"\"))","v":0},null,{"$f":"IF(AND(D3=\"\",OR(P3<>\"\",R3<>\"\",U3<>\"\")),IF(AND(X3=FALSE,Y3=FALSE,Z3=FALSE),1000,IF(Z3=TRUE,2000,2000))+ROW(),\"\")","v":""},null,{"$f":"IF(OR(B3=\"Blank\",B3=\"SBT\"),D3,C3)","v":""},1028,{"$f":"IF(LEFT(E3,1)<>LEFT(F3,1),1,0)","v":1},null,null,null,null,null,null,{"$f":"IF(OR(Q3<>\"\",T3<>\"\",W3<>\"\",AF3<>\"\",AH3<>\"\",AJ3<>\"\",AL3<>\"\",AN3<>\"\",AP3<>\"\",AR3<>\"\",AT3<>\"\",AV3<>\"\",AY3<>\"\",BC3<>\"\",BE3<>\"\",BH3<>\"\"),\"TM\",\"\")","v":""},{"$f":"A3","v":0},null,null,null,"??",null,null,"??",null,null,null,null,null,null,{"$f":"O3","v":0},null,null,null,null,null,null,null,null,null,null,null,null,null,null,null,null,null,null,null,null,null,null,null,{"$f":"O3","v":0}]
[null,null,null,null,null,null,null,null,null,null,null,null,null,null,null,null,null,null,null,null,null,null,null,null,null,null,null,null,null,0,null,null,true,null,{"$f":"SUM(ABS(AD28:AD29))","v":0},null,"ADJ_1",null,"ADJ_2",null,"ADJ_3",null,"ADJ_4",null,"ADJ_5",null,null,null,null,null,null,null,null,{"$f":"COUNTIF(#REF!,\"<>Grp_Hair\")","v":{"$error":"#REF!"}}]
[null,null,null,null,null,null,null,null,null,null,null,null,null,null,{"$f":"COUNTIF(F10:F34,\"<1999\")-2","v":0},null,null,null,null,null,null,null,null,null,null,null,null,null,null,{"$f":"4+AD4","v":4},null,null,null,null,null,null,1,null,null,null,null,null,null,null,null,null,null,null,null,null,null,null,null,null,null,"Error"]
[2,null,null,null,null,null,null,null,null,null,"Name:",null,null,null,null,null,null,null,null,null,null,null,null,null,null,null,null,null,null,null,null,null,null,null,null,null,null,null,{"$f":"SUBTOTAL(9,AM16:AM65536)","v":0},null,{"$f":"SUBTOTAL(9,AO16:AO65536)","v":0},null,{"$f":"SUBTOTAL(9,AQ16:AQ65536)","v":0}]
[null,null,null,null,null,null,null,null,null,null,null,null,null,null,null,null,null,null,null,null,null,null,null,null,null,null,null,null,null,null,null,null,null,null,null,null,null,null,null,null,null,null,null,null,null,null,null,null,null,null,null,null,null,null,null,null,"PROTECTED A (when completed)"]
[null,null,null,null,null,null,null,null,null,null,null,null,null,null,"Complete the Group Materiality and Component Data worksheets before beginning the Component Analysis",null,null,null,null,null,null,null,null,null,null,null,null,null,null,"Component Analysis sheet - Select the allocation method, round and make other adjustments to allocated amounts",null,null,null,null,null,null,null,null,null,null,null,null,null,null,null,null,null,null,null,null,null,null,null,"Component Analysis - Apply Haircut for Performance Materiality"]
[null,null,null,null,null,null,null,null,null,null,null,null,null,null,"Component Analysis - In this section you will sort components into categories for allocation of materiality. The component information columns are pre-populated with information you have entered in the two benchmark columns on the \"Component Data\" sheet.\n- Component Exclusion Factors - Select relevant component exclusion factors for each component to exclude components from the framework allocation. Click any (or all) of the three boxes that are relevant for each individual component.  If any exclusion box is checked, the component will not be included in the initial allocation of overall group materiality using the multiplier. This step may be N/A if you've already excluded all components from the data entry tab that will not be included in the allocation.\n- Click \"Sort Components\" and review component categorization. Components categorized in the top section \"Included in Allocation\" will be included in the calculation.  Components categorized in the bottom section \"Not Included in Allocation\" will not be included in the calculation.\n- If category adjustments are necessary for certain components, update component exclusion factor check boxes and click \"Sort Components\" again.\n- Click \"Edit Data\" to change component data input information.  These changes will also be reflected in the \"Component Data\" worksheet.\n- Columns labeled TM may be used for tickmarks. An area for tickmark explanations is included below the calculations.\n",null,null,null,null,null,null,null,null,null,null,null,null,null,null,"- Click \"Select Alternative Allocation Benchmark\", then select the alternative benchmark to use for allocation from the drop down menu.  The selection includes the benchmark(s) entered on the \"Component Data\" worksheet, however, you would typically use the benchmark selected for group overall materiality (which is pre-populated). The allocation considers the number of components in the \"Included in Allocation\" category and uses the appropriate multiple of overall materiality in the calculation. The percentage on the top of the column is the materiality multiplier (See Materiality Multiple Guidance button).\n- Review the initial distribution of Total Component Overall Materiality (this is the Group Materiality X the appropriate multiplier based on the number of components).\n- Click \"Rounding Adjustment\", then select an automatic rounding increment or manual rounding.\n- Enter adjustments in the Adjustment column.  Click \"Additional Adjustment(s)\" to add up to 4 additional adjustment columns. The additional adjustment columns allow you to keep adjustments separated and name each column (such as for risk, statutory audits, etc.) or you may use tickmarks to explain adjustments.\n- Review the Total Adjustments (includes rounding) and Component Overall Materiality for reasonableness.\n",null,null,null,null,null,null,null,null,null,null,null,null,null,null,null,null,null,null,null,null,null,null,null,"-Click \"Performance Materiality Haircut\" and select the \"Group Haircut\" to be applied to all components or select \"Tailored Haircut for Each Component\" which allows you to enter a separate haircut % for each component.  If you choose to enter a tailored haircut for each component, the cells will initially populate with the group haircut and you will be able to adjust each individual haircut. You should document your rationale for tailored haircuts that are significantly different from the group haircut.  When finished tailoring haircuts the number of components with a tailored haircut that is different from the group haircut is included on the \"Component Materiality\" summary page.\n-Review the reasonableness of the Component Performance Materiality."]
[]
[]
[]
[]
[]
[]
[]
[null,null,null,null,null,null,null,null,null,null,null,null,null,"Component Worksheet"]
[]
[]
[]
[]
[]
[]
[null,null,null,null,null,null,null,null,null,null,null,null,null,null,null,null,null,null,null,null,null,null,null,{"$f":"IF(AND(G1=FALSE,SUM($G$20:$G$33)>0),\"Click 'Sort Components' when completed!\",\"\")","v":""}]
[null,null,null,null,null,null,null,null,null,null,null,null,null,null,"Component Information",null,null,null,null,null,null,null,null,"Component Exclusion Factors",null,null,null,null,null,null,null,null,"Total Component Overall Materiality Allocation"]
[null,null,null,"Delete",null,"Start","Change?",null,null,null,"Unique",null,null,true,"#","Component Materiality Determined By",null,{"$f":"'Component Data'!E10","v":"[Enter Name]"},null,"TM",{"$f":"'Component Data'!F10","v":"[Enter Name]"},null,"TM","Financially Inconsequential","Shared Service Centers","No or Very Limited Audit Procedures","TM",null,"#","[Select Allocation Method]",null,"TM","Initial Allocation",null,{"$f":"\"Rounded Allocation\"&IF(AND(Rnd_Man=\"\"),\" [\"&Rnd_Val&\"]\",\"\")","v":"Rounded Allocation [10,000]"},"TM","[Adjustment Name]","TM","[Adjustment Name]","TM","[Adjustment Name]","TM","[Adjustment Name]","TM","[Adjustment Name]","TM","Total Adjustments","TM","Component Overall Materiality","%","TM",null,"#","Haircut %","TM","Performance Materiality Haircut","TM","Component Performance Materiality",null,"TM"]
[0,"SBT",{"$f":"IF(AND(D27=\"\",OR(P27<>\"\",R27<>\"\",U27<>\"\")),IF(AND(X27=FALSE,Y27=FALSE,Z27=FALSE),1000,2000)+ROW(),\"\")","v":""},999,{"$f":"IF(OR(B27=\"Blank\",B27=\"SBT\"),D27,C27)","v":999},999,null,null,null,{"$f":"SMALL($F$20:$F$33,1)","v":999},null,null,null,true,null,null,null,"HUF","%",null,"HUF","%",null,null,null,null,null,null,null,"HUF","%",null,{"$f":"+'Component Materiality'!T25","v":0},null,"HUF",null,null,null,null,null,null,null,null,null,null,null,"HUF",null,"HUF",null,null,null,null,null,null,"HUF",null,"HUF","%"]
[{"$f":"IF(C28<>\"\",MAX(A$27:A27)+1,\"\")","v":""},"Blank",{"$f":"IF(AND(D28=\"\",OR(P28<>\"\",R28<>\"\",U28<>\"\")),IF(AND(X28=FALSE,Y28=FALSE,Z28=FALSE),1000,2000)+ROW(),\"\")","v":""},1000,{"$f":"IF(OR(B28=\"Blank\",B28=\"SBT\"),D28,C28)","v":1000},1000,{"$f":"IF(LEFT(E28,1)<>LEFT(F28,1),1,0)","v":0},null,null,null,null,null,null,null,null,"Included in Allocation",null,null,null,null,null,null,null,{"$f":"\"---\"","v":"---"},"---","---",null,null,null,null,null,null,null,null,null,null,null,null,null,null,null,null,null,null,null,null,null,null,null,null,null,null,null,null,null,null,null,null,null,null,null,null,null,"Determined by Allocation"]
[{"$f":"IF(C29<>\"\",MAX(A$27:A28)+1,\"\")","v":""},"SBT",{"$f":"IF(AND(D29=\"\",OR(P29<>\"\",R29<>\"\",U29<>\"\")),IF(AND(X29=FALSE,Y29=FALSE,Z29=FALSE),1000,2000)&\" \"&P29,\"\")","v":""},1999,1999,1999,0,null,null,null,"",null,null,null,null,null,null,{"$f":"SUBTOTAL(9,R28:R28)","v":0},{"$f":"IF(R$33=0,\"\",R29/R$33)","v":""},null,{"$f":"SUBTOTAL(9,U28:U28)","v":0},{"$f":"IF(U$33=0,\"\",U29/U$33)","v":""},null,"---","---","---",null,null,null,{"$f":"SUBTOTAL(9,AD28:AD28)","v":0},{"$f":"IF(AD$33=0,\"\",AD29/AD$33)","v":""},null,{"$f":"SUBTOTAL(9,AG28:AG28)","v":0},null,{"$f":"SUBTOTAL(9,AI28:AI28)","v":0},null,{"$f":"SUBTOTAL(9,AK28:AK28)","v":0},null,{"$f":"SUBTOTAL(9,AM28:AM28)","v":0},null,{"$f":"SUBTOTAL(9,AO28:AO28)","v":0},null,{"$f":"SUBTOTAL(9,AQ28:AQ28)","v":0},null,{"$f":"SUBTOTAL(9,AS28:AS28)","v":0},null,{"$f":"SUBTOTAL(9,AU28:AU28)","v":0},null,{"$f":"SUBTOTAL(9,AW28:AW28)","v":0},{"$f":"IF(AW$33=0,\"\",AW29/AW$33)","v":""},null,null,null,null,null,{"$f":"SUBTOTAL(9,BD28:BD28)","v":0},null,{"$f":"SUBTOTAL(9,BF28:BF28)","v":0},{"$f":"IF(BF$29=0,\"\",BF29/BF$29)","v":""}]
[{"$f":"IF(C30<>\"\",MAX(A$27:A29)+1,\"\")","v":""},"Blank",{"$f":"IF(AND(D30=\"\",OR(P30<>\"\",R30<>\"\",U30<>\"\")),IF(AND(X30=FALSE,#REF!=FALSE,Z30=FALSE),1000,2000)&\" \"&P30,\"\")","v":""},2000,2000,2000,0,null,null,null,"",null,null,null,null,"Not Included in Allocation",null,null,{"$f":"IF(U30<>\"\",MAX(S$27:S29)+1,\"\")","v":""},null,null,null,null,"---","---","---",null,null,null,null,null,null,null,null,null,null,null,null,null,null,null,null,null,null,null,null,null,null,null,null,null,null,null,null,null,null,null,null,null,null,null,null,null,"Determined by Professional Judgment"]
{"$rows_left_out":388}
{"sheet":"Component Materiality","index":3,"n_rows":60,"n_cols":22,"rows_kept":60,"cut":false,"hidden":false,"merged":[[8,19,8,22],[18,10,18,15],[43,17,43,19],[22,10,22,15],[26,11,26,15],[28,10,28,15],[24,11,24,15],[42,17,42,19],[20,10,20,15],[39,10,39,21],[40,10,40,21],[10,10,12,12],[10,15,10,21],[16,10,16,15],[12,15,12,16],[14,9,14,22],[12,20,12,21],[49,9,49,10],[51,9,51,10],[30,10,30,15],[34,11,34,15],[32,11,32,15],[36,10,36,15],[38,9,38,22],[47,9,47,10]]}
[44,null,null,null,null,null,null,null,null,null,11,12,null,{"$f":"N2-4","v":29},null,{"$f":"P2-4","v":45},null,{"$f":"R2-4","v":50},null,{"$f":"T2-4","v":52},null,{"$f":"V2-4","v":54}]
[null,null,null,null,null,null,null,null,null,"Actual",15,16,null,33,null,49,null,54,null,56,null,58]
[null,{"$f":"SMALL('Component Analysis'!$E$20:$E34,ROW()-$A$1)","v":{"$error":"#NUM!"}},{"$f":"IF(ISERROR(B3),\"N\",IF(OR(B3=\"\",B3>4999),\"N\",\"Y\"))","v":"N"},{"$f":"IF(C3=\"N\",\"\",IF(AND(C3=\"Y\",B3>3000,B3<>4999),\"YN\",\"\"))","v":""},{"$f":"IF(C3=\"Y\",IF(OR(RIGHT(B3,3)=\"000\"),\"H\",IF(RIGHT(B3,3)=\"999\",\"B\",\"\")),\"\")","v":""},null,null,null,null,null,{"$f":"IF(AND(C3<>\"N\",E3<>\"H\",E3<>\"B\"),VLOOKUP($B3,'Component Analysis'!$E:$IV,K$1,FALSE),\"\")","v":""},{"$f":"IF(AND($C3=\"Y\",$E3<>\"B\",B3<4000),VLOOKUP($B3,'Component Analysis'!$E:$IV,L$1,FALSE),\"\")","v":{"$error":"#NUM!"}},null,{"$f":"IF(AND($C3=\"Y\",$E3<>\"H\",D3<>\"YN\"),VLOOKUP($B3,'Component Analysis'!$E:$IV,N$1,FALSE),\"\")","v":""},null,{"$f":"IF(AND($C3=\"Y\",$E3<>\"H\",G3<>\"YN\"),VLOOKUP($B3,'Component Analysis'!$E:$IV,P$1,FALSE),\"\")","v":""},null,{"$f":"IF(AND($C3=\"Y\",$E3<>\"H\",I3<>\"YN\"),VLOOKUP($B3,'Component Analysis'!$E:$IV,R$1,FALSE),\"\")","v":""},null,{"$f":"IF(AND($C3=\"Y\",$E3<>\"H\",K3<>\"YN\"),VLOOKUP($B3,'Component Analysis'!$E:$IV,T$1,FALSE),\"\")","v":""},null,{"$f":"IF(AND($C3=\"Y\",$E3<>\"H\",M3<>\"YN\"),VLOOKUP($B3,'Component Analysis'!$E:$IV,V$1,FALSE),\"\")","v":""}]
[]
[null,null,null,null,null,null,null,{"$f":"COLUMN()","v":8}]
[]
[]
[]
[null,null,null,null,null,null,null,null,null,null,null,null,null,null,null,null,null,null,null,"PROTECTED A (when completed)"]
[]
[null,null,null,null,null,null,null,null,null,null,"Component Materiality",null,null,"Name","Engagement: ",{"$f":"IF(Eng_Nm=\"\",\"Enter Engagement Name on Materiality Worksheet!\",Eng_Nm)","v":"Enter Engagement Name on Materiality Worksheet!"}]
[]
[null,null,null,null,null,null,null,null,null,null,null,null,null,null,"Year End: ",{"$f":"IF(OR(YE=\"MM/DD/YYYY\", YE=\"\"),\"Enter YE\",YE)","v":"Enter YE"},null,null,null,null,"READY FOR REVIEW"]
[]
[null,null,null,null,null,null,null,null,null,"   Component Materiality Summary                                                                    Information on this summary is populated from other tabs in this workbook"]
[]
[null,null,null,null,null,null,null,null,null,null,"Group overall materiality [from Group Materiality worksheet]",null,null,null,null,null,null,null,null,{"$f":"Grp_Mat","v":0}]
[]
[null,null,null,null,null,null,null,null,null,null,"Number of components included in allocation [from Component Analysis worksheet]",null,null,null,null,null,null,null,null,{"$f":"Comp_Numb","v":0}]
[]
[null,null,null,null,null,null,null,null,null,null,"Number of components not included in allocation [from Component Analysis worksheet]",null,null,null,null,null,null,null,null,{"$f":"COUNTA('Component Data'!D11:D393)-T19","v":0}]
[]
[null,null,null,null,null,null,null,null,null,null,"Total component overall materiality:"]
[]
[null,null,null,null,null,null,null,null,null,null,null,"Group overall materiality multiple [Group Overall Materiality table in OAG Audit 2334]",null,null,null,null,null,null,null,{"$f":"IF(ISERROR(Comp_Mult),0,Comp_Mult)","v":0}]
[]
[null,null,null,null,null,null,null,null,null,null,null,"Total component overall materiality [Group overall materiality x Group overall materiality multiple]",null,null,null,null,null,null,null,{"$f":"T25*T17","v":0}]
[]
[null,null,null,null,null,{"$f":"VLOOKUP(1999,$B$40:$Y$1966,15,FALSE)","v":{"$error":"#N/A"}},null,null,null,null,"Sum of adjusted component overall materialities from the allocation [from Component Analysis worksheet]",null,null,null,null,null,null,null,null,{"$f":"IF(ISERROR(F29),0,F29)","v":0},"[see detail below]"]
[]
{"$rows_left_out":31}
{"sheet":"Sheet1","index":4,"n_rows":0,"n_cols":0,"rows_kept":0,"cut":false,"hidden":false,"merged":[]}

{"sheet":"SecurityLabel","index":5,"n_rows":10,"n_cols":1,"rows_kept":10,"cut":false,"hidden":true,"merged":[]}
["UNCLASSIFIED"]
["NON CLASSIFIÉ"]
["PROTECTED A"]
["PROTÉGÉ A"]
["PROTECTED B"]
["PROTÉGÉ B"]
["PROTECTED A (when completed)"]
["PROTÉGÉ A (lorsque rempli)"]
["PROTECTED B (when completed)"]
["PROTÉGÉ B (lorsque rempli)"]

{"sheet":"Round","index":6,"n_rows":2,"n_cols":2,"rows_kept":2,"cut":false,"hidden":true,"merged":[]}
[]
["10,000","Round Value"]

{"sheet":"Comp_Mult_Calc","index":7,"n_rows":19,"n_cols":6,"rows_kept":19,"cut":false,"hidden":true,"merged":[[5,0,5,1]]}
[{"$f":"Comp_Numb","v":0}]
[]
[{"$f":"IF(ISERROR(A1),0,VLOOKUP(A1,A8:C19,3,TRUE))","v":{"$error":"#N/A"}}]
[]
[]
["Component Range"]
["Min","Max","Multiple",0.5,0.25,0.1]
[1,null,1]
[2,null,1.86,1.5,1.8,1.9]
[3,null,2.76,2,2.5,2.9]
[4,null,3.66,3,3.5,3.75]
[5,null,4.5,3,4,4.75]
[6,10,4.66,3,4,5]
[11,20,5.66,4,5,6]
[21,50,6.66,5,6,7]
[51,75,7.66,6,7,8]
[76,100,8.66,7,8,9]
[101,125,9.66,8,9,10]
[126,null,10.66,9,10,11]